Discussion:
[gem5-dev] Cron <m5test@zizzer> /z/m5/regression/do-regression --scratch all
(too old to reply)
Cron Daemon
2018-11-25 15:45:47 UTC
Permalink
scons: *** [build/ALPHA/systemc/utils/vcd.do] Error 1
scons: *** [build/MIPS/systemc/utils/vcd.do] Error 1
scons: *** [build/NULL/systemc/utils/vcd.do] Error 1
scons: *** [build/NULL_MOESI_hammer/systemc/utils/vcd.do] Error 1
scons: *** [build/NULL_MESI_Two_Level/systemc/utils/vcd.do] Error 1
scons: *** [build/NULL_MOESI_CMP_directory/systemc/utils/vcd.do] Error 1
scons: *** [build/NULL_MOESI_CMP_token/systemc/utils/vcd.do] Error 1
scons: *** [build/POWER/systemc/utils/vcd.do] Error 1
scons: *** [build/SPARC/systemc/utils/vcd.do] Error 1
scons: *** [build/X86/systemc/utils/vcd.do] Error 1
scons: *** [build/X86_MESI_Two_Level/systemc/utils/vcd.do] Error 1
scons: *** [build/ARM/systemc/utils/vcd.do] Error 1
scons: *** [build/RISCV/systemc/utils/vcd.do] Error 1
scons: *** [build/HSAIL_X86/systemc/utils/vcd.do] Error 1
scons: *** [build/ALPHA/systemc/utils/vcd.fo] Error 1
scons: *** [build/MIPS/systemc/utils/vcd.fo] Error 1
scons: *** [build/NULL/systemc/utils/vcd.fo] Error 1
scons: *** [build/NULL/mem/abstract_mem.fo] Error 1
scons: *** [build/NULL_MOESI_hammer/systemc/utils/vcd.fo] Error 1
scons: *** [build/NULL_MOESI_hammer/mem/abstract_mem.fo] Error 1
scons: *** [build/NULL_MESI_Two_Level/systemc/utils/vcd.fo] Error 1
scons: *** [build/NULL_MESI_Two_Level/mem/abstract_mem.fo] Error 1
scons: *** [build/NULL_MOESI_CMP_directory/systemc/utils/vcd.fo] Error 1
scons: *** [build/NULL_MOESI_CMP_directory/mem/abstract_mem.fo] Error 1
scons: *** [build/NULL_MOESI_CMP_token/mem/abstract_mem.fo] Error 1
scons: *** [build/NULL_MOESI_CMP_token/systemc/utils/vcd.fo] Error 1
scons: *** [build/POWER/systemc/utils/vcd.fo] Error 1
scons: *** [build/SPARC/systemc/utils/vcd.fo] Error 1
scons: *** [build/X86/systemc/utils/vcd.fo] Error 1
scons: *** [build/X86_MESI_Two_Level/systemc/utils/vcd.fo] Error 1
scons: *** [build/ARM/systemc/utils/vcd.fo] Error 1
scons: *** [build/RISCV/systemc/utils/vcd.fo] Error 1
scons: *** [build/HSAIL_X86/systemc/utils/vcd.fo] Error 1
scons: *** [build/ALPHA/systemc/utils/vcd.o] Error 1
scons: `build/ALPHA/tests/opt/long/se' is up to date.
scons: *** [build/MIPS/systemc/utils/vcd.o] Error 1
scons: `build/MIPS/tests/opt/quick/fs' is up to date.
scons: `build/MIPS/tests/opt/long/se' is up to date.
scons: `build/MIPS/tests/opt/long/fs' is up to date.
scons: *** [build/NULL/systemc/utils/vcd.o] Error 1
scons: `build/NULL/tests/opt/quick/fs' is up to date.
scons: `build/NULL/tests/opt/long/se' is up to date.
scons: `build/NULL/tests/opt/long/fs' is up to date.
scons: *** [build/NULL_MOESI_hammer/systemc/utils/vcd.o] Error 1
scons: `build/NULL_MOESI_hammer/tests/opt/quick/fs' is up to date.
scons: `build/NULL_MOESI_hammer/tests/opt/long/se' is up to date.
scons: `build/NULL_MOESI_hammer/tests/opt/long/fs' is up to date.
scons: *** [build/NULL_MESI_Two_Level/systemc/utils/vcd.o] Error 1
scons: `build/NULL_MESI_Two_Level/tests/opt/quick/fs' is up to date.
scons: `build/NULL_MESI_Two_Level/tests/opt/long/se' is up to date.
scons: `build/NULL_MESI_Two_Level/tests/opt/long/fs' is up to date.
scons: *** [build/NULL_MOESI_CMP_directory/systemc/utils/vcd.o] Error 1
scons: `build/NULL_MOESI_CMP_directory/tests/opt/quick/fs' is up to date.
scons: `build/NULL_MOESI_CMP_directory/tests/opt/long/se' is up to date.
scons: `build/NULL_MOESI_CMP_directory/tests/opt/long/fs' is up to date.
scons: *** [build/NULL_MOESI_CMP_token/systemc/utils/vcd.o] Error 1
scons: `build/NULL_MOESI_CMP_token/tests/opt/quick/fs' is up to date.
scons: `build/NULL_MOESI_CMP_token/tests/opt/long/se' is up to date.
scons: `build/NULL_MOESI_CMP_token/tests/opt/long/fs' is up to date.
scons: *** [build/POWER/systemc/utils/vcd.o] Error 1
scons: `build/POWER/tests/opt/quick/fs' is up to date.
scons: `build/POWER/tests/opt/long/se' is up to date.
scons: `build/POWER/tests/opt/long/fs' is up to date.
scons: *** [build/SPARC/systemc/utils/vcd.o] Error 1
scons: *** [build/X86/systemc/utils/vcd.o] Error 1
scons: `build/X86/tests/opt/quick/fs' is up to date.
scons: `build/X86/tests/opt/long/fs' is up to date.
scons: `build/X86_MESI_Two_Level/tests/opt/quick/se' is up to date.
scons: `build/X86_MESI_Two_Level/tests/opt/quick/fs' is up to date.
scons: `build/X86_MESI_Two_Level/tests/opt/long/se' is up to date.
scons: `build/X86_MESI_Two_Level/tests/opt/long/fs' is up to date.
scons: *** [build/ARM/systemc/utils/vcd.o] Error 1
scons: *** [build/RISCV/systemc/utils/vcd.o] Error 1
scons: `build/RISCV/tests/opt/quick/fs' is up to date.
scons: `build/RISCV/tests/opt/long/se' is up to date.
scons: `build/RISCV/tests/opt/long/fs' is up to date.
scons: *** [build/HSAIL_X86/systemc/utils/vcd.o] Error 1
scons: `build/HSAIL_X86/tests/opt/quick/fs' is up to date.
scons: `build/HSAIL_X86/tests/opt/long/se' is up to date.
scons: `build/HSAIL_X86/tests/opt/long/fs' is up to date.

See /z/m5/regression/regress-2018-11-25-03:00:01 for details.

Continue reading on narkive:
Loading...